Flock-bin Error While Loading Shared Libraries Libjemalloc.so

RECOMMENDED: If you have Windows errors then we strongly recommend that you download and run this (Windows) Repair Tool.

Error De Certificado Facebook Chrome Si una página incluye un certificado con un periodo de validez que no se corresponde con la zona horaria de

/opt/splunk/bin/splunkd: error while loading shared libraries: libmongoc-1.0.so.0: cannot open shared object file: No such file or directory.

Splunk doesn't launch – Question | Splunk Answers – /opt/splunk/bin/splunkd: error while loading shared libraries: libjemalloc.so.1: cannot open shared object file: No such file or directory

Lampp – error while loading shared libraries: libc.so.6 xampp. – April 3, 2013 @ 5:27 PM. "/bin/bash: error while loading shared libraries: libdl.so.2: cannot open shared object file: No such file or directory". Had the same issue as Denis on Red Hat, but I changed line 50

splnkd can't find libjemalloc.so.1 – Question | Splunk Answers – bin/splunkd: error while loading shared libraries: libjemalloc.so.1: cannot open shared object file: No such file or directory. I checked and found the libjemalloc.so.1 and libjemalloc.so in /usr/local/lib, why splunk can't find it?

I get this error: freeview.bin: error while loading shared libraries: libpng12.so.0: cannot open shared object file: No such file or directory. And when I am trying to install this package

/opt/splunk/bin/splunkd: error while loading shared libraries: libssl.so.0.9.8: cannot open shared object file: No such file or directory. How can I.

Hbo On Demand Error 106 HBO On Demand not working – Comcast XFINITY TV. – Jul 31, 2005  · Forum discussion: I just had cable installed

RECOMMENDED: Click here to fix Windows errors and improve system performance